Reaction Details
TargetVasopressin V2 receptor
LigandBDBM50152979
Substrate/Competitorn/a
Meas. Tech.ChEMBL_304151 (CHEMBL828131)
EC50 890±n/a nM
Citation Pitt, GRBatt, ARHaigh, RMPenson, AMRobson, PARooker, DPTartar, ALTrim, JEYea, CMRoe, MB Non-peptide oxytocin agonists. Bioorg Med Chem Lett14:4585-9 (2004) 
 
Vasopressin V2 receptor
Name:Vasopressin V2 receptor
Type:Receptor
Mol. Mass.:40295.28
Organism:Homo sapiens (Human)
Description:P30518
Residue:371
BDBM50152979
NameBDBM50152979
Synonyms:(S)-2-(4-Methyl-[1,4]diazepane-1-carbothioyl)-pyrrolidine-1-carboxylic acid 2-methyl-4-(5,6,7,8-tetrahydro-thieno[3,2-b]azepine-4-carbonyl)-benzylamide | CHEMBL365862
TypeSmall organic molecule
Emp. Form.C29H39N5O2S2
Mol. Mass.553.782
SMILESCN1CCCN(CC1)C(=S)[C@@H]1CCCN1C(=O)NCc1ccc(cc1C)C(=O)N1CCCCc2sccc12