Reaction Details
TargetPeptide deformylase
LigandBDBM50153080
Substrate/Competitorn/a
Meas. Tech.ChEMBL_303553 (CHEMBL828953)
Ki 23±n/a nM
Citation Hu, XNguyen, KTJiang, VCLofland, DMoser, HEPei, D Macrocyclic inhibitors for peptide deformylase: a structure-activity relationship study of the ring size. J Med Chem47:4941-9 (2004) 
 
Peptide deformylase
Name:Peptide deformylase
Type:n/a
Mol. Mass.:16901.39
Organism:Escherichia coli
Description:n/a
Residue:150
BDBM50153080
NameBDBM50153080
Synonyms:(R)-2-[(Formyl-hydroxy-amino)-methyl]-hexanoic acid [5-amino-1-((S)-phenylcarbamoyl)-pentyl]-amide | CHEMBL360609
TypeSmall organic molecule
Emp. Form.C20H32N4O4
Mol. Mass.392.4925
SMILESCCCC[C@H](CN(O)C=O)C(=O)N[C@@H](CCCCN)C(=O)Nc1ccccc1