Reaction Details
TargetPeptide deformylase
LigandBDBM50153084
Substrate/Competitorn/a
Meas. Tech.ChEMBL_303553 (CHEMBL828953)
Ki 710±n/a nM
Citation Hu, XNguyen, KTJiang, VCLofland, DMoser, HEPei, D Macrocyclic inhibitors for peptide deformylase: a structure-activity relationship study of the ring size. J Med Chem47:4941-9 (2004) 
 
Peptide deformylase
Name:Peptide deformylase
Type:n/a
Mol. Mass.:16901.39
Organism:Escherichia coli
Description:n/a
Residue:150
BDBM50153084
NameBDBM50153084
Synonyms:CHEMBL361449 | N-(4-{(3R,14S)-14-[(Formyl-hydroxy-amino)-methyl]-3,15-dioxo-1,4diaza-cyclopentadec-2-yl}-butyl)-acetamide
TypeSmall organic molecule
Emp. Form.C21H38N4O5
Mol. Mass.426.5502
SMILESCC(=O)NCCCC[C@@H]1NC(=O)[C@@H](CN(O)C=O)CCCCCCCCCNC1=O