Reaction Details
TargetPeptide deformylase
LigandBDBM50153083
Substrate/Competitorn/a
Meas. Tech.ChEMBL_303545 (CHEMBL839750)
Ki 0.33±n/a nM
Citation Hu, XNguyen, KTJiang, VCLofland, DMoser, HEPei, D Macrocyclic inhibitors for peptide deformylase: a structure-activity relationship study of the ring size. J Med Chem47:4941-9 (2004) 
 
Peptide deformylase
Name:Peptide deformylase
Type:n/a
Mol. Mass.:16901.39
Organism:Escherichia coli
Description:n/a
Residue:150
BDBM50153083
NameBDBM50153083
Synonyms:CHEMBL441502 | N-((3S,6R)-3-tert-Butyl-2,5-dioxo-1,4diaza-cyclopentadec-6-ylmethyl)-N-hydroxy-formamide
TypeSmall organic molecule
Emp. Form.C19H35N3O4
Mol. Mass.369.4989
SMILESCC(C)(C)[C@@H]1NC(=O)[C@@H](CN(O)C=O)CCCCCCCCCNC1=O