Reaction Details
TargetPeptide deformylase
LigandBDBM50153079
Substrate/Competitorn/a
Meas. Tech.ChEMBL_303545 (CHEMBL839750)
Ki 36±n/a nM
Citation Hu, XNguyen, KTJiang, VCLofland, DMoser, HEPei, D Macrocyclic inhibitors for peptide deformylase: a structure-activity relationship study of the ring size. J Med Chem47:4941-9 (2004) 
 
Peptide deformylase
Name:Peptide deformylase
Type:n/a
Mol. Mass.:16901.39
Organism:Escherichia coli
Description:n/a
Residue:150
BDBM50153079
NameBDBM50153079
Synonyms:CHEMBL364979 | N-[(3S,6R)-3-(4-Amino-butyl)-2,5-dioxo-1,4diaza-cycloicos-6-ylmethyl]-N-hydroxy-formamide
TypeSmall organic molecule
Emp. Form.C24H46N4O4
Mol. Mass.454.6464
SMILESNCCCC[C@@H]1NC(=O)[C@@H](CN(O)C=O)CCCCCCCCCCCCCCNC1=O