Reaction Details
TargetDNA polymerase alpha catalytic subunit
LigandBDBM50153106
Substrate/Competitorn/a
Meas. Tech.ChEMBL_303330 (CHEMBL840055)
Ki 18500±n/a nM
Citation Oshige, MKuramochi, KOhta, KOgawa, AKuriyama, HSugawara, FKobayashi, SSakaguchi, K Molecular design of cholesterols as inhibitors of DNA polymerase alpha. J Med Chem47:4971-4 (2004) 
 
DNA polymerase alpha catalytic subunit
Name:DNA polymerase alpha catalytic subunit
Type:PROTEIN
Mol. Mass.:165895.25
Organism:Homo sapiens (Human)
Description:ChEMBL_1365493
Residue:1462
BDBM50153106
NameBDBM50153106
Synonyms:CHEMBL189703 | [(3S,10R,13R,17R)-17-((R)-1,5-Dimethyl-hexyl)-10,13-dimethyl-2,3,4,7,8,9,10,11,12,13,14,15,16,17-tetradecahydro-1H-cyclopenta[a]phenanthren-3-yloxy]-acetic acid
TypeSmall organic molecule
Emp. Form.C29H48O3
Mol. Mass.444.6896
SMILESCC(C)CCC[C@@H](C)[C@H]1CCC2C3CC=C4C[C@H](CC[C@]4(C)C3CC[C@]12C)OCC(O)=O