Reaction Details
TargetProtein farnesyltransferase subunit beta/geranylgeranyltransferase type-1 subunit alpha
LigandBDBM50153168
Substrate/Competitorn/a
Meas. Tech.ChEMBL_310170 (CHEMBL824826)
EC50 1.34±n/a nM
Citation Lin, NHWang, LWang, XWang, GTCohen, JGu, WZZhang, HRosenberg, SHSham, HL Synthesis and biological evaluation of 1-benzyl-5-(3-biphenyl-2-yl-propyl)-1H-imidazole as novel farnesyltransferase inhibitor. Bioorg Med Chem Lett14:5057-62 (2004) 
 
Protein farnesyltransferase subunit beta/geranylgeranyltransferase type-1 subunit alpha
Name:Protein farnesyltransferase subunit beta/geranylgeranyltransferase type-1 subunit alpha
Type:n/a
Mol. Mass.:n/a
Description:ASSAY_ID of EBI is 38702
Components:This complex has 2 components.
Component 1
Name:Protein farnesyltransferase/geranylgeranyltransferase type-1 subunit alpha
Synonyms:CAAX farnesyltransferase subunit alpha FTase-alpha GGTase-I-alpha Protein farnesyltransferase/geranylgeranyltransferase type-1 subunit alpha Type I protein geranyl-geranyltransferase subunit alpha
Type:PROTEIN
Mol. Mass.:43994.09
Organism:Mus musculus
Description:EBI_10570
Residue:377
Component 2
Name:Protein farnesyltransferase subunit beta
Synonyms:FNTB_MOUSE Protein farnesyltransferase
Type:PROTEIN
Mol. Mass.:48811.61
Organism:Mus musculus
Description:EBI_12341
Residue:437
BDBM50153168
NameBDBM50153168
Synonyms:6-({[3-(4-Cyano-benzyl)-3H-imidazol-4-ylmethyl]-amino}-methyl)-3''-ethoxy-biphenyl-3-carbonitrile CHEMBL361246
TypeSmall organic molecule
Emp. Form.C28H25N5O
Mol. Mass.447.531
SMILESCCOc1cccc(c1)-c1cc(ccc1CNCc1cncn1Cc1ccc(cc1)C#N)C#N