Reaction Details
TargetMicrosomal triglyceride transfer protein large subunit
LigandBDBM50153193
Substrate/Competitorn/a
Meas. Tech.ChEMBL_312764 (CHEMBL833176)
IC50 3±n/a nM
Citation Sulsky, RRobl, JABiller, SAHarrity, TWWetterau, JConnolly, FJolibois, KKunselman, L 5-Carboxamido-1,3,2-dioxaphosphorinanes, potent inhibitors of MTP. Bioorg Med Chem Lett14:5067-70 (2004) 
 
Microsomal triglyceride transfer protein large subunit
Name:Microsomal triglyceride transfer protein large subunit
Type:PROTEIN
Mol. Mass.:99365.65
Organism:Homo sapiens (Human)
Description:ChEMBL_971724
Residue:894
BDBM50153193
NameBDBM50153193
Synonyms:CHEMBL186836 | Trans-9-{4-[5-(2-Benzooxazol-2-yl-benzoylamino)-2-oxo-2lambda*5*-[1,3,2]dioxaphosphinan-2-yl]-butyl}-9H-fluorene-9-carboxylic acid (2,2,2-trifluoro-ethyl)-amide
TypeSmall organic molecule
Emp. Form.C37H33F3N3O6P
Mol. Mass.703.6434
SMILESFC(F)(F)CNC(=O)C1(CCCCP2(=O)OCC(CO2)NC(=O)c2ccccc2-c2nc3ccccc3o2)c2ccccc2-c2ccccc12