Reaction Details
TargetRNA-directed RNA polymerase
LigandBDBM50153250
Substrate/Competitorn/a
Meas. Tech.ChEMBL_306255 (CHEMBL828388)
IC50 2600±n/a nM
Citation Stansfield, IAvolio, SColarusso, SGennari, NNarjes, FPacini, BPonzi, SHarper, S Active site inhibitors of HCV NS5B polymerase. The development and pharmacophore of 2-thienyl-5,6-dihydroxypyrimidine-4-carboxylic acid. Bioorg Med Chem Lett14:5085-8 (2004) 
 
RNA-directed RNA polymerase
Name:RNA-directed RNA polymerase
Type:Protein
Mol. Mass.:25173.95
Organism:Hepatitis C virus
Description:Q8JXU8
Residue:229
BDBM50153250
NameBDBM50153250
Synonyms:5,6-Dihydroxy-2-thiophen-2-yl-pyrimidine-4-carboxylic acid 5,6-dihydroxy-2-(thiophen-2-yl)pyrimidine-4-carboxylic acid | CHEMBL181653
TypeSmall organic molecule
Emp. Form.C9H6N2O4S
Mol. Mass.238.22
SMILESOC(=O)c1nc([nH]c(=O)c1O)-c1cccs1