Reaction Details
TargetD(4) dopamine receptor
LigandBDBM50153256
Substrate/Competitorn/a
Meas. Tech.ChEMBL_310597 (CHEMBL834253)
EC50>10000±n/a nM
Citation Matulenko, MASurber, BFan, LKolasa, TNakane, MTerranova, MAUchic, MEMiller, LNChang, RDonnelly-Roberts, DLNamovic, MTMoreland, RBBrioni, JDStewart, AO Synthesis and activity of 2-[4-(4-[3H]-2-cyanophenyl)piperazinyl]-N-(2,4,6-[3H]3-3-methylphenyl)acetamide: a selective dopamine D4 receptor agonist and radioligand. Bioorg Med Chem Lett14:5095-8 (2004) 
 
D(4) dopamine receptor
Name:D(4) dopamine receptor
Type:Enzyme
Mol. Mass.:48373.19
Organism:Homo sapiens (Human)
Description:P21917
Residue:419
BDBM50153256
NameBDBM50153256
Synonyms:2-[4-(4-Benzhydryl-phenyl)-piperazin-1-yl]-N-m-tolyl-acetamide | CHEMBL363308
TypeSmall organic molecule
Emp. Form.C32H33N3O
Mol. Mass.475.6239
SMILESCc1cccc(NC(=O)CN2CCN(CC2)c2ccc(cc2)C(c2ccccc2)c2ccccc2)c1