Reaction Details
TargetD(4) dopamine receptor
LigandBDBM50153257
Substrate/Competitorn/a
Meas. Tech.ChEMBL_310597 (CHEMBL834253)
EC50 96±n/a nM
Citation Matulenko, MASurber, BFan, LKolasa, TNakane, MTerranova, MAUchic, MEMiller, LNChang, RDonnelly-Roberts, DLNamovic, MTMoreland, RBBrioni, JDStewart, AO Synthesis and activity of 2-[4-(4-[3H]-2-cyanophenyl)piperazinyl]-N-(2,4,6-[3H]3-3-methylphenyl)acetamide: a selective dopamine D4 receptor agonist and radioligand. Bioorg Med Chem Lett14:5095-8 (2004) 
 
D(4) dopamine receptor
Name:D(4) dopamine receptor
Type:Enzyme
Mol. Mass.:48373.19
Organism:Homo sapiens (Human)
Description:P21917
Residue:419
BDBM50153257
NameBDBM50153257
Synonyms:CHEMBL185149 | N-(4-Bromo-3-methyl-phenyl)-2-[4-(2-cyano-phenyl)-piperazin-1-yl]-acetamide
TypeSmall organic molecule
Emp. Form.C20H21BrN4O
Mol. Mass.413.311
SMILESCc1cc(NC(=O)CN2CCN(CC2)c2ccccc2C#N)ccc1Br