Reaction Details
TargetD(4) dopamine receptor
LigandBDBM50153263
Substrate/Competitorn/a
Meas. Tech.ChEMBL_302983 (CHEMBL828832)
Ki 101±n/a nM
Citation Matulenko, MASurber, BFan, LKolasa, TNakane, MTerranova, MAUchic, MEMiller, LNChang, RDonnelly-Roberts, DLNamovic, MTMoreland, RBBrioni, JDStewart, AO Synthesis and activity of 2-[4-(4-[3H]-2-cyanophenyl)piperazinyl]-N-(2,4,6-[3H]3-3-methylphenyl)acetamide: a selective dopamine D4 receptor agonist and radioligand. Bioorg Med Chem Lett14:5095-8 (2004) 
 
D(4) dopamine receptor
Name:D(4) dopamine receptor
Type:Enzyme
Mol. Mass.:48373.19
Organism:Homo sapiens (Human)
Description:P21917
Residue:419
BDBM50153263
NameBDBM50153263
Synonyms:2-[4-(4-Methoxy-phenyl)-piperazin-1-yl]-N-m-tolyl-acetamide | CHEMBL184772
TypeSmall organic molecule
Emp. Form.C20H25N3O2
Mol. Mass.339.4314
SMILESCOc1ccc(cc1)N1CCN(CC(=O)Nc2cccc(C)c2)CC1