Reaction Details
TargetD(4) dopamine receptor
LigandBDBM21398
Substrate/Competitorn/a
Meas. Tech.ChEMBL_302872 (CHEMBL828786)
Ki 1.9±n/a nM
Citation Matulenko, MASurber, BFan, LKolasa, TNakane, MTerranova, MAUchic, MEMiller, LNChang, RDonnelly-Roberts, DLNamovic, MTMoreland, RBBrioni, JDStewart, AO Synthesis and activity of 2-[4-(4-[3H]-2-cyanophenyl)piperazinyl]-N-(2,4,6-[3H]3-3-methylphenyl)acetamide: a selective dopamine D4 receptor agonist and radioligand. Bioorg Med Chem Lett14:5095-8 (2004) 
 
D(4) dopamine receptor
Name:D(4) dopamine receptor
Type:Enzyme
Mol. Mass.:48373.19
Organism:Homo sapiens (Human)
Description:P21917
Residue:419
BDBM21398
NameBDBM21398
Synonyms:4-[4-(4-Chloro-phenyl)-4-hydroxy-piperidin-1-yl]-1-(4-fluoro-phenyl)-butan-1-one;propionate(HCl) CHEMBL54 Haloperidol | Haloperidol, 1
TypeSmall organic molecule
Emp. Form.C21H23ClFNO2
Mol. Mass.375.864
SMILESOC1(CCN(CCCC(=O)c2ccc(F)cc2)CC1)c1ccc(Cl)cc1