Reaction Details
TargetD(4) dopamine receptor
LigandBDBM50153258
Substrate/Competitorn/a
Meas. Tech.ChEMBL_302872 (CHEMBL828786)
Ki>10000±n/a nM
Citation Matulenko, MASurber, BFan, LKolasa, TNakane, MTerranova, MAUchic, MEMiller, LNChang, RDonnelly-Roberts, DLNamovic, MTMoreland, RBBrioni, JDStewart, AO Synthesis and activity of 2-[4-(4-[3H]-2-cyanophenyl)piperazinyl]-N-(2,4,6-[3H]3-3-methylphenyl)acetamide: a selective dopamine D4 receptor agonist and radioligand. Bioorg Med Chem Lett14:5095-8 (2004) 
 
D(4) dopamine receptor
Name:D(4) dopamine receptor
Type:Enzyme
Mol. Mass.:48373.19
Organism:Homo sapiens (Human)
Description:P21917
Residue:419
BDBM50153258
NameBDBM50153258
Synonyms:2-(4-Biphenyl-4-yl-piperazin-1-yl)-N-m-tolyl-acetamide | CHEMBL184263
TypeSmall organic molecule
Emp. Form.C25H27N3O
Mol. Mass.385.5014
SMILESCc1cccc(NC(=O)CN2CCN(CC2)c2ccc(cc2)-c2ccccc2)c1