Reaction Details
TargetSodium/glucose cotransporter 2
LigandBDBM50153297
Substrate/Competitorn/a
Meas. Tech.ChEMBL_308700 (CHEMBL834935)
Ki 1280±n/a nM
Citation Dudash, JZhang, XZeck, REJohnson, SGCox, GGConway, BRRybczynski, PJDemarest, KT Glycosylated dihydrochalcones as potent and selective sodium glucose co-transporter 2 (SGLT2) inhibitors. Bioorg Med Chem Lett14:5121-5 (2004) 
 
Sodium/glucose cotransporter 2
Name:Sodium/glucose cotransporter 2
Type:Protein
Mol. Mass.:72902.00
Organism:Homo sapiens (Human)
Description:P31639
Residue:672
BDBM50153297
NameBDBM50153297
Synonyms:1-[2-Amino-4-methyl-6-(3,4,5-trihydroxy-6-hydroxymethyl-tetrahydro-pyran-2-yloxy)-phenyl]-3-(4-ethoxy-phenyl)-propan-1-one | CHEMBL360824
TypeSmall organic molecule
Emp. Form.C24H31NO8
Mol. Mass.461.5048
SMILESCCOc1ccc(CCC(=O)c2c(N)cc(C)cc2O[C@@H]2O[C@H](CO)[C@@H](O)[C@H](O)[C@H]2O)cc1