Reaction Details
TargetSodium/glucose cotransporter 1
LigandBDBM50153299
Substrate/Competitorn/a
Meas. Tech.ChEMBL_308699 (CHEMBL834934)
Ki 4640±n/a nM
Citation Dudash, JZhang, XZeck, REJohnson, SGCox, GGConway, BRRybczynski, PJDemarest, KT Glycosylated dihydrochalcones as potent and selective sodium glucose co-transporter 2 (SGLT2) inhibitors. Bioorg Med Chem Lett14:5121-5 (2004) 
 
Sodium/glucose cotransporter 1
Name:Sodium/glucose cotransporter 1
Type:Protein
Mol. Mass.:73503.78
Organism:Homo sapiens (Human)
Description:P13866
Residue:664
BDBM50153299
NameBDBM50153299
Synonyms:1-[4-Chloro-2-hydroxy-6-(3,4,5-trihydroxy-6-hydroxymethyl-tetrahydro-pyran-2-yloxy)-phenyl]-3-(4-ethoxy-phenyl)-propan-1-one | CHEMBL362365
TypeSmall organic molecule
Emp. Form.C23H27ClO9
Mol. Mass.482.908
SMILESCCOc1ccc(CCC(=O)c2c(O)cc(Cl)cc2O[C@@H]2O[C@H](CO)[C@@H](O)[C@H](O)[C@H]2O)cc1