Reaction Details
TargetSodium/glucose cotransporter 2
LigandBDBM50153298
Substrate/Competitorn/a
Meas. Tech.ChEMBL_308700 (CHEMBL834935)
Ki 10±n/a nM
Citation Dudash, JZhang, XZeck, REJohnson, SGCox, GGConway, BRRybczynski, PJDemarest, KT Glycosylated dihydrochalcones as potent and selective sodium glucose co-transporter 2 (SGLT2) inhibitors. Bioorg Med Chem Lett14:5121-5 (2004) 
 
Sodium/glucose cotransporter 2
Name:Sodium/glucose cotransporter 2
Type:Protein
Mol. Mass.:72902.00
Organism:Homo sapiens (Human)
Description:P31639
Residue:672
BDBM50153298
NameBDBM50153298
Synonyms:3-(2,3-Dihydro-benzo[1,4]dioxin-6-yl)-1-[4-ethyl-2-hydroxy-6-(3,4,5-trihydroxy-6-hydroxymethyl-tetrahydro-pyran-2-yloxy)-phenyl]-propan-1-one | CHEMBL359962
TypeSmall organic molecule
Emp. Form.C25H30O10
Mol. Mass.490.4997
SMILESCCc1cc(O)c(C(=O)CCc2ccc3OCCOc3c2)c(O[C@@H]2O[C@H](CO)[C@@H](O)[C@H](O)[C@H]2O)c1