Reaction Details
TargetGlucocorticoid receptor
LigandBDBM50153510
Substrate/Competitorn/a
Meas. Tech.ChEMBL_305576 (CHEMBL828024)
IC50 14±n/a nM
Citation Shah, NScanlan, TS Design and evaluation of novel nonsteroidal dissociating glucocorticoid receptor ligands. Bioorg Med Chem Lett14:5199-203 (2004) 
 
Glucocorticoid receptor
Name:Glucocorticoid receptor
Type:Enzyme Catalytic Domain
Mol. Mass.:87556.83
Organism:RAT
Description:Glucocorticoid 0 RAT::P06536
Residue:795
BDBM50153510
NameBDBM50153510
Synonyms:CHEMBL360248 | [(4aR,5S)-1-(4-Fluoro-phenyl)-4a-methyl-4,4a,5,6,7,8-hexahydro-1H-benzo[f]indazol-5-yl]-(4-trifluoromethyl-phenyl)-methanol
TypeSmall organic molecule
Emp. Form.C26H24F4N2O
Mol. Mass.456.4752
SMILESC[C@]12Cc3cnn(c3C=C1CCC[C@@H]2C(O)c1ccc(cc1)C(F)(F)F)-c1ccc(F)cc1