Reaction Details
TargetGlucocorticoid receptor
LigandBDBM50153514
Substrate/Competitorn/a
Meas. Tech.ChEMBL_305576 (CHEMBL828024)
IC50 6.6±n/a nM
Citation Shah, NScanlan, TS Design and evaluation of novel nonsteroidal dissociating glucocorticoid receptor ligands. Bioorg Med Chem Lett14:5199-203 (2004) 
 
Glucocorticoid receptor
Name:Glucocorticoid receptor
Type:Enzyme Catalytic Domain
Mol. Mass.:87556.83
Organism:RAT
Description:Glucocorticoid 0 RAT::P06536
Residue:795
BDBM50153514
NameBDBM50153514
Synonyms:4-{[(4aR,5S)-1-(4-Fluoro-phenyl)-4a-methyl-4,4a,5,6,7,8-hexahydro-1H-benzo[f]indazol-5-yl]-hydroxy-methyl}-phenol | CHEMBL186930
TypeSmall organic molecule
Emp. Form.C25H25FN2O2
Mol. Mass.404.4766
SMILESC[C@]12Cc3cnn(c3C=C1CCC[C@@H]2C(O)c1ccc(O)cc1)-c1ccc(F)cc1