Reaction Details
TargetGlucocorticoid receptor
LigandBDBM50153515
Substrate/Competitorn/a
Meas. Tech.ChEMBL_305576 (CHEMBL828024)
IC50 4.9±n/a nM
Citation Shah, NScanlan, TS Design and evaluation of novel nonsteroidal dissociating glucocorticoid receptor ligands. Bioorg Med Chem Lett14:5199-203 (2004) 
 
Glucocorticoid receptor
Name:Glucocorticoid receptor
Type:Enzyme Catalytic Domain
Mol. Mass.:87556.83
Organism:RAT
Description:Glucocorticoid 0 RAT::P06536
Residue:795
BDBM50153515
NameBDBM50153515
Synonyms:1-[(4aR,5S)-1-(4-Fluoro-phenyl)-4a-methyl-4,4a,5,6,7,8-hexahydro-1H-benzo[f]indazol-5-yl]-nonan-1-ol | CHEMBL183475
TypeSmall organic molecule
Emp. Form.C27H37FN2O
Mol. Mass.424.5939
SMILESCCCCCCCCC(O)[C@H]1CCCC2=Cc3c(C[C@]12C)cnn3-c1ccc(F)cc1