Reaction Details
TargetGlucocorticoid receptor
LigandBDBM50153512
Substrate/Competitorn/a
Meas. Tech.ChEMBL_305277 (CHEMBL832826)
IC50 5±n/a nM
Citation Shah, NScanlan, TS Design and evaluation of novel nonsteroidal dissociating glucocorticoid receptor ligands. Bioorg Med Chem Lett14:5199-203 (2004) 
 
Glucocorticoid receptor
Name:Glucocorticoid receptor
Type:Enzyme
Mol. Mass.:85656.87
Organism:Homo sapiens (Human)
Description:P04150
Residue:777
BDBM50153512
NameBDBM50153512
Synonyms:(9R,10S,11S,13S,14S,16R,17R)-9-Fluoro-11,17-dihydroxy-10,13,16-trimethyl-3-oxo-6,7,8,9,10,11,12,13,14,15,16,17-dodecahydro-3H-cyclopenta[a]phenanthrene-17-carboxylic acid | CHEMBL433586
TypeSmall organic molecule
Emp. Form.C21H27FO5
Mol. Mass.378.4345
SMILESC[C@@H]1C[C@H]2C3CCC4=CC(=O)C=C[C@]4(C)[C@@]3(F)[C@@H](O)C[C@]2(C)[C@@]1(O)C(O)=O