Reaction Details
TargetIntegrin alpha-V/beta-3
LigandBDBM50153558
Substrate/Competitorn/a
Meas. Tech.ChEMBL_305375 (CHEMBL832890)
IC50 1.7±n/a nM
Citation De Corte, BLKinney, WALiu, LGhosh, SBrunner, LHoekstra, WJSantulli, RJTuman, RWBaker, JBurns, CProost, JCTounge, BADamiano, BPMaryanoff, BEJohnson, DLGalemmo, RA Piperidine-containing beta-arylpropionic acids as potent antagonists of alphavbeta3/alphavbeta5 integrins. Bioorg Med Chem Lett14:5227-32 (2004) 
 
Integrin alpha-V/beta-3
Name:Integrin alpha-V/beta-3
Type:Enzyme
Mol. Mass.:n/a
Description:n/a
Components:This complex has 2 components.
Component 1
Name:Integrin alpha-V
Synonyms:ITAV_HUMAN Integrin alpha-V/alpha-5 VNRA Vitronectin receptor | Vitronectin receptor subunit alpha
Type:PROTEIN
Mol. Mass.:116024.92
Organism:Homo sapiens (Human)
Description:ChEMBL_582336
Residue:1048
Component 2
Name:Integrin beta-3
Synonyms:CD_antigen=CD61 GPIIIa ITGB3 Platelet membrane glycoprotein IIIa
Type:Protein
Mol. Mass.:87038.91
Organism:Homo sapiens (Human)
Description:P05106
Residue:788
BDBM50153558
NameBDBM50153558
Synonyms:3-Benzo[1,3]dioxol-5-yl-5-{1-[3-(5-hydroxy-1,4,5,6-tetrahydro-pyridin-2-ylamino)-benzoyl]-piperidin-4-yl}-pentanoic acid | CHEMBL184635
TypeSmall organic molecule
Emp. Form.C29H35N3O6
Mol. Mass.521.6047
SMILESOC1CCC(Nc2cccc(c2)C(=O)N2CCC(CCC(CC(O)=O)c3ccc4OCOc4c3)CC2)=NC1