Reaction Details
TargetIntegrin alpha-V/beta-3
LigandBDBM50153559
Substrate/Competitorn/a
Meas. Tech.ChEMBL_305375 (CHEMBL832890)
IC50 0.7±n/a nM
Citation De Corte, BLKinney, WALiu, LGhosh, SBrunner, LHoekstra, WJSantulli, RJTuman, RWBaker, JBurns, CProost, JCTounge, BADamiano, BPMaryanoff, BEJohnson, DLGalemmo, RA Piperidine-containing beta-arylpropionic acids as potent antagonists of alphavbeta3/alphavbeta5 integrins. Bioorg Med Chem Lett14:5227-32 (2004) 
 
Integrin alpha-V/beta-3
Name:Integrin alpha-V/beta-3
Type:Enzyme
Mol. Mass.:n/a
Description:n/a
Components:This complex has 2 components.
Component 1
Name:Integrin alpha-V
Synonyms:ITAV_HUMAN Integrin alpha-V/alpha-5 VNRA Vitronectin receptor | Vitronectin receptor subunit alpha
Type:PROTEIN
Mol. Mass.:116024.92
Organism:Homo sapiens (Human)
Description:ChEMBL_582336
Residue:1048
Component 2
Name:Integrin beta-3
Synonyms:CD_antigen=CD61 GPIIIa ITGB3 Platelet membrane glycoprotein IIIa
Type:Protein
Mol. Mass.:87038.91
Organism:Homo sapiens (Human)
Description:P05106
Residue:788
BDBM50153559
NameBDBM50153559
Synonyms:3-(2-Methyl-pyrimidin-5-yl)-4-[1-(3-5,6,7,8-tetrahydro-[1,8]naphthyridin-2-yl-propionyl)-piperidin-4-yl]-butyric acid | CHEMBL186908
TypeSmall organic molecule
Emp. Form.C25H33N5O3
Mol. Mass.451.5612
SMILESCc1ncc(cn1)C(CC1CCN(CC1)C(=O)CCc1ccc2CCCNc2n1)CC(O)=O