Reaction Details
TargetMu-type opioid receptor
LigandBDBM50153608
Substrate/Competitorn/a
Meas. Tech.ChEMBL_303543 (CHEMBL839748)
Ki 0.11±n/a nM
Citation Chen, ZDavies, EMiller, WSShan, SValenzano, KJKyle, DJ Design and synthesis of 4-phenyl piperidine compounds targeting the mu receptor. Bioorg Med Chem Lett14:5275-9 (2004) 
 
Mu-type opioid receptor
Name:Mu-type opioid receptor
Type:G Protein-Coupled Receptor (GPCR)
Mol. Mass.:44789.51
Organism:Homo sapiens (Human)
Description:P35372
Residue:400
BDBM50153608
NameBDBM50153608
Synonyms:4-[4-Hydroxy-4-(3-trifluoromethyl-phenyl)-piperidin-1-yl]-2,2-diphenyl-butyric acid methyl ester | CHEMBL364625
TypeSmall organic molecule
Emp. Form.C29H30F3NO3
Mol. Mass.497.5486
SMILESCOC(=O)C(CCN1CCC(O)(CC1)c1cccc(c1)C(F)(F)F)(c1ccccc1)c1ccccc1