Reaction Details
Target5-hydroxytryptamine receptor 1A
LigandBDBM50153621
Substrate/Competitorn/a
Meas. Tech.ChEMBL_303745 (CHEMBL829788)
Ki 107±n/a nM
Citation Gilbert, AMColeman, TKodah, JMewshaw, REScerni, RSchechter, LESmith, DLAndree, TH Novel aryloxy-8-azabicyclo[3.2.1]oct-3-enes with 5-HT transporter and 5-HT1A affinity. Bioorg Med Chem Lett14:5281-4 (2004) 
 
5-hydroxytryptamine receptor 1A
Name:5-hydroxytryptamine receptor 1A
Type:n/a
Mol. Mass.:46122.49
Organism:Homo sapiens (Human)
Description:n/a
Residue:422
BDBM50153621
NameBDBM50153621
Synonyms:(S)-1-[3-(3,4-Dichloro-phenyl)-8-aza-bicyclo[3.2.1]oct-2-en-8-yl]-3-(1H-indol-4-yloxy)-propan-2-ol | CHEMBL441316
TypeSmall organic molecule
Emp. Form.C24H24Cl2N2O2
Mol. Mass.443.366
SMILESO[C@H](COc1cccc2[nH]ccc12)CN1C2CCC1C=C(C2)c1ccc(Cl)c(Cl)c1