Reaction Details
TargetRibonucleoside-diphosphate reductase large subunit/subunit M2
LigandBDBM50153688
Substrate/Competitorn/a
Meas. Tech.ChEMBL_306437 (CHEMBL829081)
IC50 13300±n/a nM
Citation Tan, CGao, YKaur, JCooperman, BS More potent linear peptide inhibitors of mammalian ribonucleotide reductase. Bioorg Med Chem Lett14:5301-4 (2004) 
 
Ribonucleoside-diphosphate reductase large subunit/subunit M2
Name:Ribonucleoside-diphosphate reductase large subunit/subunit M2
Type:Enzyme
Mol. Mass.:n/a
Description:n/a
Components:This complex has 2 components.
Component 1
Name:Ribonucleoside-diphosphate reductase large subunit
Synonyms:RIR1_HUMAN RRM1 Ribonucleoside-diphosphate reductase subunit M1 | Ribonucleotide reductase large subunit
Type:PROTEIN
Mol. Mass.:90074.67
Organism:Homo sapiens (Human)
Description:ChEMBL_90946
Residue:792
Component 2
Name:Ribonucleoside-diphosphate reductase subunit M2
Synonyms:RIR2_HUMAN RRM2 Ribonucleotide reductase small chain | Ribonucleotide reductase small subunit
Type:PROTEIN
Mol. Mass.:44868.59
Organism:Homo sapiens (Human)
Description:ChEMBL_195255
Residue:389
BDBM50153688
NameBDBM50153688
Synonyms:(S)-3-[(S)-2-((S)-2-{(S)-2-[(2S,3R)-2-((S)-2-Acetylamino-3-phenyl-propionylamino)-3-hydroxy-butyrylamino]-4-methyl-pentanoylamino}-3-carboxy-propionylamino)-propionylamino]-N-((S)-1-carboxy-2-phenyl-ethyl)-succinamic acid AcFTLDADF | CHEMBL148859
TypeSmall organic molecule
Emp. Form.C41H55N7O14
Mol. Mass.869.9139
SMILESCC(C)C[C@H](NC(=O)[C@@H](NC(=O)[C@H](Cc1ccccc1)NC(C)=O)[C@@H](C)O)C(=O)N[C@@H](CC(O)=O)C(=O)N[C@@H](C)C(=O)N[C@@H](CC(O)=O)C(=O)N[C@@H](Cc1ccccc1)C(O)=O