Reaction Details
TargetRibonucleoside-diphosphate reductase large subunit/subunit M2
LigandBDBM50153689
Substrate/Competitorn/a
Meas. Tech.ChEMBL_306437 (CHEMBL829081)
IC50 1900±n/a nM
Citation Tan, CGao, YKaur, JCooperman, BS More potent linear peptide inhibitors of mammalian ribonucleotide reductase. Bioorg Med Chem Lett14:5301-4 (2004) 
 
Ribonucleoside-diphosphate reductase large subunit/subunit M2
Name:Ribonucleoside-diphosphate reductase large subunit/subunit M2
Type:Enzyme
Mol. Mass.:n/a
Description:n/a
Components:This complex has 2 components.
Component 1
Name:Ribonucleoside-diphosphate reductase large subunit
Synonyms:RIR1_HUMAN RRM1 Ribonucleoside-diphosphate reductase subunit M1 | Ribonucleotide reductase large subunit
Type:PROTEIN
Mol. Mass.:90074.67
Organism:Homo sapiens (Human)
Description:ChEMBL_90946
Residue:792
Component 2
Name:Ribonucleoside-diphosphate reductase subunit M2
Synonyms:RIR2_HUMAN RRM2 Ribonucleotide reductase small chain | Ribonucleotide reductase small subunit
Type:PROTEIN
Mol. Mass.:44868.59
Organism:Homo sapiens (Human)
Description:ChEMBL_195255
Residue:389
BDBM50153689
NameBDBM50153689
Synonyms:(S)-N-{(S)-1-[(S)-2-Carboxy-1-((S)-1-carboxy-2-phenyl-ethylcarbamoyl)-ethylcarbamoyl]-2-cyclohexyl-ethyl}-3-((S)-2-{2-[(9H-fluoren-9-ylmethoxycarbonyl)-methyl-amino]-2-phenyl-acetylamino}-4-methyl-pentanoylamino)-succinamic acid | CHEMBL269498
TypeSmall organic molecule
Emp. Form.C56H66N6O13
Mol. Mass.1031.1556
SMILESCC(C)C[C@H](NC(=O)C(N(C)C(=O)OCC1c2ccccc2-c2ccccc12)c1ccccc1)C(=O)N[C@@H](CC(O)=O)C(=O)N[C@@H](CC1CCCCC1)C(=O)N[C@@H](CC(O)=O)C(=O)N[C@@H](Cc1ccccc1)C(O)=O