Reaction Details
TargetMetabotropic glutamate receptor 2
LigandBDBM50153742
Substrate/Competitorn/a
Meas. Tech.ChEMBL_304322 (CHEMBL829294)
EC50 2013±n/a nM
Citation Pinkerton, ABCube, RVHutchinson, JHRowe, BASchaffhauser, HZhao, XDaggett, LPVernier, JM Allosteric potentiators of the metabotropic glutamate receptor 2 (mGlu2). Part 1: Identification and synthesis of phenyl-tetrazolyl acetophenones. Bioorg Med Chem Lett14:5329-32 (2004) 
 
Metabotropic glutamate receptor 2
Name:Metabotropic glutamate receptor 2
Type:Enzyme
Mol. Mass.:95584.88
Organism:Homo sapiens (Human)
Description:Q14416
Residue:872
BDBM50153742
NameBDBM50153742
Synonyms:1-[2-Hydroxy-4-(4-{methyl-[4-(2H-tetrazol-5-yl)-phenyl]-amino}-butoxy)-3-propyl-phenyl]-ethanone | CHEMBL425540
TypeSmall organic molecule
Emp. Form.C23H29N5O3
Mol. Mass.423.5081
SMILESCCCc1c(OCCCCN(C)c2ccc(cc2)-c2nnn[nH]2)ccc(C(C)=O)c1O