Reaction Details
TargetMetabotropic glutamate receptor 2
LigandBDBM50153746
Substrate/Competitorn/a
Meas. Tech.ChEMBL_304322 (CHEMBL829294)
EC50 939±n/a nM
Citation Pinkerton, ABCube, RVHutchinson, JHRowe, BASchaffhauser, HZhao, XDaggett, LPVernier, JM Allosteric potentiators of the metabotropic glutamate receptor 2 (mGlu2). Part 1: Identification and synthesis of phenyl-tetrazolyl acetophenones. Bioorg Med Chem Lett14:5329-32 (2004) 
 
Metabotropic glutamate receptor 2
Name:Metabotropic glutamate receptor 2
Type:Enzyme
Mol. Mass.:95584.88
Organism:Homo sapiens (Human)
Description:Q14416
Residue:872
BDBM50153746
NameBDBM50153746
Synonyms:1-(2-Hydroxy-3-propyl-4-{4-[4-(2H-tetrazol-5-yl)-phenylamino]-butoxy}-phenyl)-ethanone | CHEMBL187959
TypeSmall organic molecule
Emp. Form.C22H27N5O3
Mol. Mass.409.4815
SMILESCCCc1c(OCCCCNc2ccc(cc2)-c2nnn[nH]2)ccc(C(C)=O)c1O