Reaction Details
TargetMetabotropic glutamate receptor 2
LigandBDBM50153748
Substrate/Competitorn/a
Meas. Tech.ChEMBL_304322 (CHEMBL829294)
EC50 918±n/a nM
Citation Pinkerton, ABCube, RVHutchinson, JHRowe, BASchaffhauser, HZhao, XDaggett, LPVernier, JM Allosteric potentiators of the metabotropic glutamate receptor 2 (mGlu2). Part 1: Identification and synthesis of phenyl-tetrazolyl acetophenones. Bioorg Med Chem Lett14:5329-32 (2004) 
 
Metabotropic glutamate receptor 2
Name:Metabotropic glutamate receptor 2
Type:Enzyme
Mol. Mass.:95584.88
Organism:Homo sapiens (Human)
Description:Q14416
Residue:872
BDBM50153748
NameBDBM50153748
Synonyms:1-(2-Hydroxy-4-{1-methyl-4-[4-(2H-tetrazol-5-yl)-phenoxy]-butoxy}-3-propyl-phenyl)-ethanone | CHEMBL187151
TypeSmall organic molecule
Emp. Form.C23H28N4O4
Mol. Mass.424.4928
SMILESCCCc1c(OC(C)CCCOc2ccc(cc2)-c2nnn[nH]2)ccc(C(C)=O)c1O