Reaction Details
TargetMetabotropic glutamate receptor 2
LigandBDBM50153750
Substrate/Competitorn/a
Meas. Tech.ChEMBL_304322 (CHEMBL829294)
EC50 304±n/a nM
Citation Pinkerton, ABCube, RVHutchinson, JHRowe, BASchaffhauser, HZhao, XDaggett, LPVernier, JM Allosteric potentiators of the metabotropic glutamate receptor 2 (mGlu2). Part 1: Identification and synthesis of phenyl-tetrazolyl acetophenones. Bioorg Med Chem Lett14:5329-32 (2004) 
 
Metabotropic glutamate receptor 2
Name:Metabotropic glutamate receptor 2
Type:Enzyme
Mol. Mass.:95584.88
Organism:Homo sapiens (Human)
Description:Q14416
Residue:872
BDBM50153750
NameBDBM50153750
Synonyms:1-(2-Hydroxy-3-methyl-4-{4-[4-(2H-tetrazol-5-yl)-phenoxy]-butoxy}-phenyl)-butan-1-one | CHEMBL185911
TypeSmall organic molecule
Emp. Form.C22H26N4O4
Mol. Mass.410.4662
SMILESCCCC(=O)c1ccc(OCCCCOc2ccc(cc2)-c2nnn[nH]2)c(C)c1O