Reaction Details
TargetMetabotropic glutamate receptor 2
LigandBDBM50130608
Substrate/Competitorn/a
Meas. Tech.ChEMBL_304322 (CHEMBL829294)
EC50 1700±n/a nM
Citation Pinkerton, ABCube, RVHutchinson, JHRowe, BASchaffhauser, HZhao, XDaggett, LPVernier, JM Allosteric potentiators of the metabotropic glutamate receptor 2 (mGlu2). Part 1: Identification and synthesis of phenyl-tetrazolyl acetophenones. Bioorg Med Chem Lett14:5329-32 (2004) 
 
Metabotropic glutamate receptor 2
Name:Metabotropic glutamate receptor 2
Type:Enzyme
Mol. Mass.:95584.88
Organism:Homo sapiens (Human)
Description:Q14416
Residue:872
BDBM50130608
NameBDBM50130608
Synonyms:2,2,2-Trifluoro-ethanesulfonic acid [4-(2-methoxy-phenoxy)-phenyl]-pyridin-3-ylmethyl-amide LY-487379 | US10800776, Example LY487379
TypeSmall organic molecule
Emp. Form.C21H19F3N2O4S
Mol. Mass.452.447
SMILESCOc1ccccc1Oc1ccc(cc1)N(Cc1cccnc1)S(=O)(=O)CC(F)(F)F