Reaction Details
TargetRNA-directed RNA polymerase
LigandBDBM50139670
Substrate/Competitorn/a
Meas. Tech.ChEMBL_306225 (CHEMBL831133)
IC50 14000±n/a nM
Citation Yannopoulos, CGXu, PNi, FChan, LPereira, OZReddy, TJDas, SKPoisson, CNguyen-Ba, NTurcotte, NProulx, MHalab, LWang, WBédard, JMorin, NHamel, MNicolas, OBilimoria, DL'Heureux, LBethell, RDionne, G HCV NS5B polymerase-bound conformation of a soluble sulfonamide inhibitor by 2D transferred NOESY. Bioorg Med Chem Lett14:5333-7 (2004) 
 
RNA-directed RNA polymerase
Name:RNA-directed RNA polymerase
Type:Protein
Mol. Mass.:25173.95
Organism:Hepatitis C virus
Description:Q8JXU8
Residue:229
BDBM50139670
NameBDBM50139670
Synonyms:3-(4-Chloro-2,5-dimethyl-benzenesulfonylamino)-5-phenyl-thiophene-2-carboxylic acid amide | CHEMBL424014
TypeSmall organic molecule
Emp. Form.C19H17ClN2O3S2
Mol. Mass.420.933
SMILESCc1cc(c(C)cc1Cl)S(=O)(=O)Nc1cc(sc1C(N)=O)-c1ccccc1