Reaction Details
TargetDNA topoisomerase 1
LigandBDBM50008923
Substrate/Competitorn/a
Meas. Tech.ChEMBL_304143 (CHEMBL840259)
EC50 350±n/a nM
Citation Manikumar, GWadkins, RMBearss, DVon Hoff, DDWani, MCWall, ME Camptothecin analogs with bulky, hydrophobic substituents at the 7-position via a Grignard reaction. Bioorg Med Chem Lett14:5377-81 (2004) 
 
DNA topoisomerase 1
Name:DNA topoisomerase 1
Type:Enzyme
Mol. Mass.:90771.02
Organism:Homo sapiens (Human)
Description:P11387
Residue:765
BDBM50008923
NameBDBM50008923
Synonyms:(S)-4-ethyl-4-hydroxy-1,12-dihydro-4H-2-oxa-6,12a-diaza-dibenzo[b,h]florene-3,13-dione 4-Ethyl-4-hydroxy-1,12-dihydro-4H-2-oxa-6,12a-diaza-dibenzo[b,h]fluorene-3,13-dione 4-Ethyl-4-hydroxy-1,12-dihydro-4H-2-oxa-6,12a-diaza-dibenzo[b,h]fluorene-3,13-dione (Camptothecin) 4-ethyl-4-hydroxy-(4S)-3,4,12,14-tetrahydro-1H-pyrano[3',4':6,7]indolizino[1,2-b]quinoline-3,14-dione Camptothecin (CT) cid_24360
TypeSmall organic molecule
Emp. Form.C20H16N2O4
Mol. Mass.348.352
SMILESCC[C@@]1(O)C(=O)OCc2c1cc1-c3nc4ccccc4cc3Cn1c2=O