Reaction Details
TargetMitogen-activated protein kinase 14
LigandBDBM50153833
Substrate/Competitorn/a
Meas. Tech.ChEMBL_305841 (CHEMBL829582)
IC50 20±n/a nM
Citation Brown, DSBelfield, AJBrown, GRCampbell, DFoubister, AMasters, DJPike, KGSnelson, WLWells, SL A novel series of p38 MAP kinase inhibitors for the potential treatment of rheumatoid arthritis. Bioorg Med Chem Lett14:5383-7 (2004) 
 
Mitogen-activated protein kinase 14
Name:Mitogen-activated protein kinase 14
Type:Serine/threonine-protein kinase
Mol. Mass.:41286.76
Organism:Homo sapiens (Human)
Description:Q16539
Residue:360
BDBM50153833
NameBDBM50153833
Synonyms:CHEMBL365688 | N-{4-Methyl-3-[4-(pyridin-2-ylmethoxy)-benzoylamino]-phenyl}-3-morpholin-4-yl-5-trifluoromethyl-benzamide
TypeSmall organic molecule
Emp. Form.C32H29F3N4O4
Mol. Mass.590.5923
SMILESCc1ccc(NC(=O)c2cc(cc(c2)C(F)(F)F)N2CCOCC2)cc1NC(=O)c1ccc(OCc2ccccn2)cc1