Reaction Details
TargetMitogen-activated protein kinase 14
LigandBDBM3532
Substrate/Competitorn/a
Meas. Tech.ChEMBL_305835 (CHEMBL874544)
IC50 560.0±n/a nM
Citation Cumming, JGMcKenzie, CLBowden, SGCampbell, DMasters, DJBreed, JJewsbury, PJ Novel, potent and selective anilinoquinazoline and anilinopyrimidine inhibitors of p38 MAP kinase. Bioorg Med Chem Lett14:5389-94 (2004) 
 
Mitogen-activated protein kinase 14
Name:Mitogen-activated protein kinase 14
Type:Serine/threonine-protein kinase
Mol. Mass.:41286.76
Organism:Homo sapiens (Human)
Description:Q16539
Residue:360
BDBM3532
NameBDBM3532
Synonyms:CHEMBL540068 N-(3-chlorophenyl)-6,7-dimethoxyquinazolin-4-amine | PD153035 Analog 31
TypeSmall organic molecule
Emp. Form.C16H14ClN3O2
Mol. Mass.315.754
SMILESCOc1cc2ncnc(Nc3cccc(Cl)c3)c2cc1OC