Reaction Details
TargetProstaglandin G/H synthase 1
LigandBDBM13063
Substrate/Competitorn/a
Meas. Tech.ChEMBL_305401 (CHEMBL833051)
IC50>100000±n/a nM
Citation Beswick, PBingham, SBountra, CBrown, TBrowning, KCampbell, IChessell, IClayton, NCollins, SCorfield, JGuntrip, SHaslam, CLambeth, PLucas, FMathews, NMurkit, GNaylor, APegg, NPickup, EPlayer, HPrice, HStevens, AStratton, SWiseman, J Identification of 2,3-diaryl-pyrazolo[1,5-b]pyridazines as potent and selective cyclooxygenase-2 inhibitors. Bioorg Med Chem Lett14:5445-8 (2004) 
 
Prostaglandin G/H synthase 1
Name:Prostaglandin G/H synthase 1
Type:Enzyme
Mol. Mass.:68692.62
Organism:Homo sapiens (Human)
Description:P23219
Residue:599
BDBM13063
NameBDBM13063
Synonyms:4-(5-methyl-3-phenyl-1,2-oxazol-4-yl)benzene-1-sulfonamide CHEMBL865 Valdecoxib | cid_119607
TypeSmall organic molecule
Emp. Form.C16H14N2O3S
Mol. Mass.314.359
SMILESCc1onc(c1-c1ccc(cc1)S(N)(=O)=O)-c1ccccc1