Reaction Details
TargetProstaglandin G/H synthase 2
LigandBDBM50153997
Substrate/Competitorn/a
Meas. Tech.ChEMBL_305402 (CHEMBL833052)
IC50 17±n/a nM
Citation Beswick, PBingham, SBountra, CBrown, TBrowning, KCampbell, IChessell, IClayton, NCollins, SCorfield, JGuntrip, SHaslam, CLambeth, PLucas, FMathews, NMurkit, GNaylor, APegg, NPickup, EPlayer, HPrice, HStevens, AStratton, SWiseman, J Identification of 2,3-diaryl-pyrazolo[1,5-b]pyridazines as potent and selective cyclooxygenase-2 inhibitors. Bioorg Med Chem Lett14:5445-8 (2004) 
 
Prostaglandin G/H synthase 2
Name:Prostaglandin G/H synthase 2
Type:Enzyme
Mol. Mass.:69003.89
Organism:Homo sapiens (Human)
Description:Recombinant Cox-2 provided by Cayman (Cayman Chemical Co.,Ann Arbor, MI).
Residue:604
BDBM50153997
NameBDBM50153997
Synonyms:3-(4-Methanesulfonyl-phenyl)-2-p-tolyl-pyrazolo[1,5-b]pyridazine | CHEMBL361472
TypeSmall organic molecule
Emp. Form.C20H17N3O2S
Mol. Mass.363.433
SMILESCc1ccc(cc1)-c1nn2ncccc2c1-c1ccc(cc1)S(C)(=O)=O