Reaction Details
TargetMu-type opioid receptor
LigandBDBM50154039
Substrate/Competitorn/a
Meas. Tech.ChEMBL_310387 (CHEMBL834471)
EC50>10000±n/a nM
Citation Breslin, HJMiskowski, TARafferty, BMCoutinho, SVPalmer, JMWallace, NHSchneider, CRKimball, ESZhang, SPLi, JColburn, RWStone, DJMartinez, RPHe, W Rationale, design, and synthesis of novel phenyl imidazoles as opioid receptor agonists for gastrointestinal disorders. J Med Chem47:5009-20 (2004) 
 
Mu-type opioid receptor
Name:Mu-type opioid receptor
Type:Enzyme Catalytic Domain
Mol. Mass.:11165.58
Organism:GUINEA PIG
Description:P97266
Residue:98
BDBM50154039
NameBDBM50154039
Synonyms:2-Amino-1-[3-(5-bromo-4-phenyl-1H-imidazol-2-yl)-3,4-dihydro-1H-isoquinolin-2-yl]-3-(4-hydroxy-phenyl)-propan-1-one | CHEMBL408680
TypeSmall organic molecule
Emp. Form.C27H25BrN4O2
Mol. Mass.517.417
SMILESN[C@@H](Cc1ccc(O)cc1)C(=O)N1Cc2ccccc2C[C@H]1c1nc(c(Br)[nH]1)-c1ccccc1