Reaction Details
TargetMu-type opioid receptor
LigandBDBM50154034
Substrate/Competitorn/a
Meas. Tech.ChEMBL_302750 (CHEMBL852357)
Ki>100±n/a nM
Citation Breslin, HJMiskowski, TARafferty, BMCoutinho, SVPalmer, JMWallace, NHSchneider, CRKimball, ESZhang, SPLi, JColburn, RWStone, DJMartinez, RPHe, W Rationale, design, and synthesis of novel phenyl imidazoles as opioid receptor agonists for gastrointestinal disorders. J Med Chem47:5009-20 (2004) 
 
Mu-type opioid receptor
Name:Mu-type opioid receptor
Type:G Protein-Coupled Receptor (GPCR)
Mol. Mass.:44503.11
Organism:Rattus norvegicus (rat)
Description:Competition binding assays were carried out using membrane preparations from transfected HN9.10 cells that constitutively expressed the mu opioid receptor.
Residue:398
BDBM50154034
NameBDBM50154034
Synonyms:2-Amino-3-(4-hydroxy-phenyl)-1-[3-(5-methyl-4-propyl-1H-imidazol-2-yl)-3,4-dihydro-1H-isoquinolin-2-yl]-propan-1-one | CHEMBL440380
TypeSmall organic molecule
Emp. Form.C25H30N4O2
Mol. Mass.418.5313
SMILESCCCc1nc([nH]c1C)[C@@H]1Cc2ccccc2CN1C(=O)[C@@H](N)Cc1ccc(O)cc1