Reaction Details
TargetEstrogen receptor beta
LigandBDBM50154088
Substrate/Competitorn/a
Meas. Tech.ChEMBL_306408 (CHEMBL828749)
IC50 1.2±n/a nM
Citation Malamas, MSManas, ESMcDevitt, REGunawan, IXu, ZBCollini, MDMiller, CPDinh, THenderson, RAKeith, JCHarris, HA Design and synthesis of aryl diphenolic azoles as potent and selective estrogen receptor-beta ligands. J Med Chem47:5021-40 (2004) 
 
Estrogen receptor beta
Name:Estrogen receptor beta
Type:PROTEIN
Mol. Mass.:59173.80
Organism:Rattus norvegicus
Description:ChEMBL_803011
Residue:530
BDBM50154088
NameBDBM50154088
Synonyms:7-Bromo-2-(4-hydroxy-phenyl)-benzooxazol-5-ol CHEMBL188528
TypeSmall organic molecule
Emp. Form.C13H8BrNO3
Mol. Mass.306.112
SMILESOc1ccc(cc1)-c1nc2cc(O)cc(Br)c2o1