Reaction Details
TargetIntegrase
LigandBDBM50154408
Substrate/Competitorn/a
Meas. Tech.ChEMBL_305758 (CHEMBL829529)
IC50 12000±n/a nM
Citation Sechi, MDerudas, MDallocchio, RDessì, ABacchi, ASannia, LCarta, FPalomba, MRagab, OChan, CShoemaker, RSei, SDayam, RNeamati, N Design and synthesis of novel indole beta-diketo acid derivatives as HIV-1 integrase inhibitors. J Med Chem47:5298-310 (2004) 
 
Integrase
Name:Integrase
Synonyms:Human immunodeficiency virus type 1 integrase
Type:PROTEIN
Mol. Mass.:32231.48
Organism:Human immunodeficiency virus 1
Description:ChEMBL_90865
Residue:288
BDBM50154408
NameBDBM50154408
TypeSmall organic molecule
Emp. Form.C19H15NO4
Mol. Mass.321.3267
SMILESOC(=O)C(=O)CC(=O)c1cn(Cc2ccccc2)c2ccccc12