Reaction Details
TargetRNA-directed RNA polymerase
LigandBDBM50154443
Substrate/Competitorn/a
Meas. Tech.ChEMBL_306663 (CHEMBL831436)
IC50>50000±n/a nM
Citation Summa, VPetrocchi, AMatassa, VGTaliani, MLaufer, RDe Francesco, RAltamura, SPace, P HCV NS5b RNA-dependent RNA polymerase inhibitors: from alpha,gamma-diketoacids to 4,5-dihydroxypyrimidine- or 3-methyl-5-hydroxypyrimidinonecarboxylic acids. Design and synthesis. J Med Chem47:5336-9 (2004) 
 
RNA-directed RNA polymerase
Name:RNA-directed RNA polymerase
Type:Protein
Mol. Mass.:25173.95
Organism:Hepatitis C virus
Description:Q8JXU8
Residue:229
BDBM50154443
NameBDBM50154443
Synonyms:2-(4-Chloro-phenyl)-6-hydroxy-5-methoxy-pyrimidine-4-carboxylic acid | CHEMBL186437
TypeSmall organic molecule
Emp. Form.C12H9ClN2O4
Mol. Mass.280.664
SMILESCOc1c(nc([nH]c1=O)-c1ccc(Cl)cc1)C(O)=O