Reaction Details
TargetRNA-directed RNA polymerase
LigandBDBM33414
Substrate/Competitorn/a
Meas. Tech.ChEMBL_306662 (CHEMBL831435)
IC50 30000±n/a nM
Citation Summa, VPetrocchi, AMatassa, VGTaliani, MLaufer, RDe Francesco, RAltamura, SPace, P HCV NS5b RNA-dependent RNA polymerase inhibitors: from alpha,gamma-diketoacids to 4,5-dihydroxypyrimidine- or 3-methyl-5-hydroxypyrimidinonecarboxylic acids. Design and synthesis. J Med Chem47:5336-9 (2004) 
 
RNA-directed RNA polymerase
Name:RNA-directed RNA polymerase
Type:Protein
Mol. Mass.:25173.95
Organism:Hepatitis C virus
Description:Q8JXU8
Residue:229
BDBM33414
NameBDBM33414
Synonyms:CHEMBL440562 | pyrimidinol carboxylic acid, 6
TypeSmall organic molecule
Emp. Form.C11H8N2O4
Mol. Mass.232.1922
SMILESOC(=O)c1nc([nH]c(=O)c1O)-c1ccccc1