Reaction Details
TargetReverse transcriptase/RNaseH
LigandBDBM50154439
Substrate/Competitorn/a
Meas. Tech.ChEMBL_304786 (CHEMBL827785)
IC50>100000±n/a nM
Citation Summa, VPetrocchi, AMatassa, VGTaliani, MLaufer, RDe Francesco, RAltamura, SPace, P HCV NS5b RNA-dependent RNA polymerase inhibitors: from alpha,gamma-diketoacids to 4,5-dihydroxypyrimidine- or 3-methyl-5-hydroxypyrimidinonecarboxylic acids. Design and synthesis. J Med Chem47:5336-9 (2004) 
 
Reverse transcriptase/RNaseH
Name:Reverse transcriptase/RNaseH
Type:PROTEIN
Mol. Mass.:65229.15
Organism:Human immunodeficiency virus 1
Description:ChEMBL_1473730
Residue:566
BDBM50154439
NameBDBM50154439
Synonyms:5,6-Dihydroxy-2-(3-hydroxy-phenyl)-pyrimidine-4-carboxylic acid | CHEMBL364321
TypeSmall organic molecule
Emp. Form.C11H8N2O5
Mol. Mass.248.1916
SMILESOC(=O)c1nc([nH]c(=O)c1O)-c1cccc(O)c1