Reaction Details
TargetReverse transcriptase/RNaseH
LigandBDBM50154444
Substrate/Competitorn/a
Meas. Tech.ChEMBL_304786 (CHEMBL827785)
IC50>100000±n/a nM
Citation Summa, VPetrocchi, AMatassa, VGTaliani, MLaufer, RDe Francesco, RAltamura, SPace, P HCV NS5b RNA-dependent RNA polymerase inhibitors: from alpha,gamma-diketoacids to 4,5-dihydroxypyrimidine- or 3-methyl-5-hydroxypyrimidinonecarboxylic acids. Design and synthesis. J Med Chem47:5336-9 (2004) 
 
Reverse transcriptase/RNaseH
Name:Reverse transcriptase/RNaseH
Type:PROTEIN
Mol. Mass.:65229.15
Organism:Human immunodeficiency virus 1
Description:ChEMBL_1473730
Residue:566
BDBM50154444
NameBDBM50154444
Synonyms:2-(3-Benzyloxy-phenyl)-5,6-dihydroxy-pyrimidine-4-carboxylic acid | CHEMBL188307
TypeSmall organic molecule
Emp. Form.C18H14N2O5
Mol. Mass.338.3142
SMILESOC(=O)c1nc([nH]c(=O)c1O)-c1cccc(OCc2ccccc2)c1