Reaction Details
TargetIntegrase
LigandBDBM33414
Substrate/Competitorn/a
Meas. Tech.ChEMBL_304962 (CHEMBL827840)
IC50>50000±n/a nM
Citation Summa, VPetrocchi, AMatassa, VGTaliani, MLaufer, RDe Francesco, RAltamura, SPace, P HCV NS5b RNA-dependent RNA polymerase inhibitors: from alpha,gamma-diketoacids to 4,5-dihydroxypyrimidine- or 3-methyl-5-hydroxypyrimidinonecarboxylic acids. Design and synthesis. J Med Chem47:5336-9 (2004) 
 
Integrase
Name:Integrase
Synonyms:Human immunodeficiency virus type 1 integrase
Type:PROTEIN
Mol. Mass.:32231.48
Organism:Human immunodeficiency virus 1
Description:ChEMBL_90865
Residue:288
BDBM33414
NameBDBM33414
TypeSmall organic molecule
Emp. Form.C11H8N2O4
Mol. Mass.232.1922
SMILESOC(=O)c1nc([nH]c(=O)c1O)-c1ccccc1