Reaction Details
TargetRNA-directed RNA polymerase
LigandBDBM50154441
Substrate/Competitorn/a
Meas. Tech.ChEMBL_306662 (CHEMBL831435)
IC50>100000±n/a nM
Citation Summa, VPetrocchi, AMatassa, VGTaliani, MLaufer, RDe Francesco, RAltamura, SPace, P HCV NS5b RNA-dependent RNA polymerase inhibitors: from alpha,gamma-diketoacids to 4,5-dihydroxypyrimidine- or 3-methyl-5-hydroxypyrimidinonecarboxylic acids. Design and synthesis. J Med Chem47:5336-9 (2004) 
 
RNA-directed RNA polymerase
Name:RNA-directed RNA polymerase
Type:Protein
Mol. Mass.:25173.95
Organism:Hepatitis C virus
Description:Q8JXU8
Residue:229
BDBM50154441
NameBDBM50154441
Synonyms:2-(4-Chloro-phenyl)-5,6-dihydroxy-pyrimidine-4-carboxylic acid methyl ester | CHEMBL188277
TypeSmall organic molecule
Emp. Form.C12H9ClN2O4
Mol. Mass.280.664
SMILESCOC(=O)c1nc([nH]c(=O)c1O)-c1ccc(Cl)cc1