Reaction Details
TargetDNA polymerase I
LigandBDBM50154439
Substrate/Competitorn/a
Meas. Tech.ChEMBL_305663 (CHEMBL828714)
IC50>100000±n/a nM
Citation Summa, VPetrocchi, AMatassa, VGTaliani, MLaufer, RDe Francesco, RAltamura, SPace, P HCV NS5b RNA-dependent RNA polymerase inhibitors: from alpha,gamma-diketoacids to 4,5-dihydroxypyrimidine- or 3-methyl-5-hydroxypyrimidinonecarboxylic acids. Design and synthesis. J Med Chem47:5336-9 (2004) 
 
DNA polymerase I
Name:DNA polymerase I
Type:PROTEIN
Mol. Mass.:103100.24
Organism:Escherichia coli (strain K12)
Description:ChEMBL_305663
Residue:928
BDBM50154439
NameBDBM50154439
Synonyms:5,6-Dihydroxy-2-(3-hydroxy-phenyl)-pyrimidine-4-carboxylic acid | CHEMBL364321
TypeSmall organic molecule
Emp. Form.C11H8N2O5
Mol. Mass.248.1916
SMILESOC(=O)c1nc([nH]c(=O)c1O)-c1cccc(O)c1