Reaction Details
TargetDNA polymerase I
LigandBDBM50154444
Substrate/Competitorn/a
Meas. Tech.ChEMBL_305663 (CHEMBL828714)
IC50>100000±n/a nM
Citation Summa, VPetrocchi, AMatassa, VGTaliani, MLaufer, RDe Francesco, RAltamura, SPace, P HCV NS5b RNA-dependent RNA polymerase inhibitors: from alpha,gamma-diketoacids to 4,5-dihydroxypyrimidine- or 3-methyl-5-hydroxypyrimidinonecarboxylic acids. Design and synthesis. J Med Chem47:5336-9 (2004) 
 
DNA polymerase I
Name:DNA polymerase I
Type:PROTEIN
Mol. Mass.:103100.24
Organism:Escherichia coli (strain K12)
Description:ChEMBL_305663
Residue:928
BDBM50154444
NameBDBM50154444
Synonyms:2-(3-Benzyloxy-phenyl)-5,6-dihydroxy-pyrimidine-4-carboxylic acid | CHEMBL188307
TypeSmall organic molecule
Emp. Form.C18H14N2O5
Mol. Mass.338.3142
SMILESOC(=O)c1nc([nH]c(=O)c1O)-c1cccc(OCc2ccccc2)c1